{"text_format":"1","workbook":"xlsx","n_sheets":11,"sheets":["Getitng Started","1. Funding & Financing Need","2. Institutional Knowledge","3. Regulatory Environment","4. Agency Staff","5. Stakeholder Environment","CMMResults","SAVED","Table 1","Internal Developer","Internal READme"],"not_rendered":{"charts":0,"images":0,"macros":1,"external_links":0,"defined_names":5,"comments":0,"pivot_tables":0},"unopened":[],"bounds":{"document_bytes":16777216,"sheet_cells":100000,"rows_first":2000,"rows_last":500,"rows_between":2000,"halvings":0,"cell_chars":16384,"cell_head_chars":4096},"cells_cut":0,"cells_raw":0,"read":"whole","date_system":"1900"}

{"sheet":"Getitng Started","index":0,"n_rows":9,"n_cols":1,"rows_kept":9,"cut":false,"hidden":false,"merged":[]}
["Public Agency Self-Assessment Tool for Value Capture Implementation"]
["Instructions for Getting Started on the Self Assessment"]
["Objectives and Background"]
["Help public agencies, public-private partnerships, and coalitions assess their readiness to implement value-capture strategies, according to project needs and benefits, magnitude of funding needs, experience with value capture, staff capacity and technical skills, regulatory environment, stakeholder support, and opportunities for stakeholder cooperation.\n"]
["Help FHWA understand the range of capacity for value capture among agencies and identify areas of need so it can tailor future outreach to meet those needs."]
["Depending on agencies’ responses, provide resources to assist with implementing value-capture strategies."]
["Upon completion of the Self-Assessment, you will have identified areas that your agency needs to develop and strengthen. The Capability-Maturity Matrix results table (at the end of the Self Assessment) can then be used to guide your agency, step-by-step through the processes needed to build capacity in areas of need and advance your agency’s use of value capture."]
["For users only using keyboards, the drop down menu answer options can be selected by using the Alt and Down Arrow keys"]
["Click here to begin the Value Capture Agency Self Assessment "]

{"sheet":"1. Funding & Financing Need","index":1,"n_rows":18,"n_cols":3,"rows_kept":18,"cut":false,"hidden":false,"merged":[[2,1,2,10],[6,1,6,10],[9,1,9,10],[11,1,11,10],[13,1,13,10],[16,0,16,1],[15,1,15,10],[5,0,5,10],[3,0,3,1],[4,0,4,1],[7,0,7,1],[8,0,8,1],[10,0,10,1],[12,0,12,1],[14,0,14,1],[10,2,10,7],[12,2,12,9]]}
["Public Agency Self-Assessment Tool for Value Capture Implementation"]
["Funding or Financing Needs "]
["1."," How would you characterize the level of funding available to your agency to meet transportation infrastructure needs—in terms of capital costs and construction, and operations and maintenance?"]
["Q1 Answer: for Capital Costs and Construction"]
["Q1 Answer: for Operations and Maintenance"]
["Definitions: \nSufficient funds available — Funding for transportation infrastructure is not significantly limited and competition for funding among projects is mild. High-priority projects are usually funded in a timely manner; funding is available for projects beyond top priorities; funding is available to meet safety, operations, and maintenance needs.\nModerately limited—Funding for transportation infrastructure is limited, with moderate competition among projects. High-priority projects are sometimes delayed because of funding gaps, but need is met eventually; funding is available to meet safety needs; funding can be difficult to secure for projects of local importance that are not top priorities; maintenance and operations funding can be inconsistent.\nHighly competitive—Significant funding gaps delay and/or sideline high-priority projects; the majority of funding is allocated to safety projects, with little availability of funds for projects focused on improving reliability, accessibility, and/or intermodal connectivity; funding for maintenance and operations is difficult to secure. Competition among projects is significant."]
["2. ","Please provide an estimate of your agency’s annual funding gap for highway or roadway transportation projects:"]
["Q2 Answer: for Captial Costs and Construction",null,"$ _____"]
["Q2 Answer: for Operations and Maintenance",null,"$ _____"]
["3.","How would you characterize the magnitude of the total funding gap as a proportion of total project need or cost? (Choose the option that most closely describes the typical funding gap.)"]
["  Q3 Answer:  "]
["4.","To what extent does your agency’s project identification, selection and prioritization process (e.g., long-range plan or STIP) integrate local and regional public policy goals such as land use planning, economic development, affordable housing, equity, and environmental preservation? (select the option that best describes your agency’s portfolio):"]
["Q4 Answer: "]
["5.","Are there planned or proposed transportation projects in your agency’s portfolio that create economic value for identifiable groups of stakeholders such as major employers, institutions, workforce development officials, real estate developers, or businesses relying on transportation improvements? "]
["Q5 Answer: "]
{"$rows_left_out":4}
{"sheet":"2. Institutional Knowledge","index":2,"n_rows":14,"n_cols":2,"rows_kept":14,"cut":false,"hidden":false,"merged":[[10,0,10,1],[12,0,12,1],[4,2,4,6],[6,2,6,9],[2,1,2,10],[5,1,5,10],[7,1,7,10],[9,1,9,10],[11,1,11,10],[4,0,4,1],[6,0,6,1],[8,0,8,1]]}
["Public Agency Self-Assessment Tool for Value Capture Implementation"]
["Interest in and Institutional Knowledge of Value Capture "]
["7.","Has there been interest in value capture, either in individual techniques or as a concept, at any level in the agency (staff and leadership)? "]
["(See Table 1 for value-capture techniques.) "]
["Q7 Answer:"]
["8.","Has the agency used or attempted to use value capture as a revenue source? "]
["Q8 Answer:"]
["9.","Has the agency engaged in long-term public-private partnerships before for non-capital projects? (These arrangements require some of the same institutional competencies as some forms of value capture.) "]
["Q9 Answer: "]
["10.","How receptive is your agency to adopting broad and competing goals such as social policy, equity, sustainability, planning, and economic development into project delivery? "]
["Q10 Answer:"]
["11. ","Responsibility for administering ongoing funding and financing follows a process and is clearly designated?"]
["Q11 Answer:"]
["Continue to next question"]

{"sheet":"3. Regulatory Environment","index":3,"n_rows":25,"n_cols":5,"rows_kept":25,"cut":false,"hidden":false,"merged":[[23,2,23,12],[4,2,4,10],[7,2,7,11],[12,2,12,13],[2,1,2,14],[5,1,5,14],[8,1,8,14],[13,1,13,14],[15,1,15,14],[23,0,23,1],[22,1,22,14],[3,0,3,14],[4,0,4,1],[6,0,6,14],[7,0,7,1],[9,0,9,1],[18,0,18,14],[19,0,19,1],[20,0,20,14],[21,0,21,1],[11,0,11,2],[12,0,12,1],[14,0,14,1],[16,0,16,14],[17,0,17,1]]}
["Public Agency Self-Assessment Tool for Value Capture Implementation"]
["Regulatory Environment  "]
["12.","Has the state enacted enabling legislation to allow any of the value-capture techniques listed in Table 1 [adjust hyperlink when online]?"]
["(See Table 1 for value-capture techniques.) "]
["Q12 Answer: "]
["13.","Have there been efforts by your agency or other agencies or stakeholders to encourage your state legislature to pass enabling legislation to allow any of the value-capture techniques listed in Table 1?"]
["(See Table 1 for value-capture techniques.) "]
["Q13 Answer: "]
["14.","\tIf enabling legislation exists, have reservations been raised about implementation due to possible litigation?"]
["Q14 Answer:"]
["15.","If yes, why?"]
["See for more information on: ",null,null,"Fifth Amendment ","Fourteenth Amendment"]
["Q15 Answer: "]
["16.","\tDo local government entities (e.g., transportation authorities, taxing authorities, planning or land use authorities) cooperate and coordinate on existing projects to improve outcomes?"]
["Q16 Answer: "]
{"$rows_left_out":11}
{"sheet":"4. Agency Staff","index":4,"n_rows":16,"n_cols":7,"rows_kept":16,"cut":false,"hidden":false,"merged":[[11,2,11,6],[13,2,13,8],[12,1,12,9],[10,1,10,9],[2,1,2,9],[11,0,11,1],[13,0,13,1]]}
["Public Agency Self-Assessment Tool for Value Capture Implementation"]
["Agency Staff Capacity, Skills, and Experience"]
["19. ","To what extent does the implementing agencies (transportation, taxing authority, or administrative) have staff with the technical analysis and project management skills and experience to perform the following tasks? "]
["Select one experience level for each value-capture task."]
["Task","Staff does not have sufficient experience to perform the task or supervise a consultant to perform the task.","Staff does not have sufficient experience to perform the task but is able to supervise a consultant hired to perform the task.","Staff has the experience to perform the task and to supervise a consultant to perform the task.","A consultant or partner agency (such as county assessor, nonprofit civic or business organization) would perform this task.","Unsure","User Message if Errror in completing form"]
["Evaluate the impact of infrastructure projects on nearby land values?",null,null,null,null,null,{"$f":"IF(COUNTA(B6:F6)>1,\"Please select one value for each row\", \"-\")","v":"-"}]
["Determine the potential benefits and risks of a given project and value-capture method and allocate the benefits and risks fairly among public sector and private sector participants and other stakeholders?",null,null,null,null,null,{"$f":"IF(COUNTA(B7:F7)>1,\"Please select one value for each row\", \"-\")","v":"-"}]
["Develop a financing plan?",null,null,null,null,null,{"$f":"IF(COUNTA(B8:F8)>1,\"Please select one value for each row\", \"-\")","v":"-"}]
["Conduct market or financial feasibility and risk analysis?",null,null,null,null,null,{"$f":"IF(COUNTA(B9:F9)>1,\"Please select one value for each row\", \"-\")","v":"-"}]
["Manage revenue collection and monitor and report on revenue captured?",null,null,null,null,null,{"$f":"IF(COUNTA(B10:F10)>1,\"Please select one value for each row\", \"-\")","v":"-"}]
["20.","Does your agency have sufficient staffing capacity to begin research, coordination, or implementation of a value-capture strategy? "]
["Q20 Answer: "]
["21.","Does the agency have access to and/or the ability to collect data about assessments; determine benefit area; determine fee or tax level; analyze impacts of the transportation investment on land value; demographic, economic, and real estate market trends?"]
["Q21 Answer: "]
[{"$f":"IF(OR(G6=\"Please select one value for each row\",G7=\"Please select one value for each row\",G8=\"Please select one value for each row\",G9=\"Please select one value for each row\",G10=\"Please select one value for each row\"),\"go back to question 19 and address any errors\",\"Proceed to the next question\")","v":"Proceed to the next question"}]
{"$rows_left_out":2}
{"sheet":"5. Stakeholder Environment","index":5,"n_rows":24,"n_cols":5,"rows_kept":24,"cut":false,"hidden":false,"merged":[[21,2,21,11],[2,1,2,14],[4,1,4,14],[6,1,6,14],[8,1,8,14],[20,1,20,14],[3,2,3,13],[5,2,5,13],[7,2,7,11],[21,0,21,1],[7,0,7,1],[5,0,5,1],[3,0,3,1]]}
["Public Agency Self-Assessment Tool for Value Capture Implementation"]
["Institutional, Civic, and Stakeholder Environment "]
["22.","Does your jurisdiction have a history or culture of cooperation among agencies and across levels of government for projects related to transportation?"]
["Q22 Answer: "]
["23."," Does your jurisdiction have experience in long-term revenue sharing with other local governments and taxing authorities? "]
["Q23 Answer: "]
["24.","Have the local business community or other stakeholders expressed interest or support for using value capture for transportation improvements or investments?"]
["Q24 Answer:"]
["25.","To what extent does your agency engage with other agencies and stakeholder groups in your community/region?  (Select one engagement level per resource)."]
["Resource","Little to No Engagement","Some or Passive Engagement","Active Engagement  ","User Message if Errror in completing form"]
["State transportation agency",null,null,null,{"$f":"IF(COUNTA(B11:D11)>1,\"Please select one value for each row\", \"-\")","v":"-"}]
["Regional transportation authority, transit authority",null,null,null,"-"]
["Municipality, neighboring municipalities",null,null,null,"-"]
["Elected officials (including State legislature, city council, county governance board)",null,null,null,"-"]
["Economic development agency, tourism bureau",null,null,null,"-"]
{"$rows_left_out":10}
{"sheet":"CMMResults","index":6,"n_rows":18,"n_cols":5,"rows_kept":18,"cut":false,"hidden":false,"merged":[]}
["Public Agency Self-Assessment Tool for Value Capture Implementation"]
["CMM Self-Assessment Results"]
["Component ","Level 1. Informal understanding","Level 2. Implementation Planning","Level 3. Active Adoption","Level 4. Institutional Maturity"]
["Component 1. Policy: appointed leadership and senior staff ","No familiarity with value capture mechanisms.","Value capture concepts have been introduced to senior policymakers, but interest is limited.","Policymakers have been briefed on full range of value capture options; understand and are ready to move forward with implementation.","Committed to support and understand role of value capture in project funding."]
["Component 1 Placement",{"$f":"IF('Internal Developer'!D41=TRUE,\"Current Maturity Level\",\"-\")","v":"-"},{"$f":"IF('Internal Developer'!D42=TRUE,\"Current Maturity Level\",IF('Internal Developer'!D43=TRUE,\"Current Maturity Level\",\"-\"))","v":"-"},{"$f":"IF('Internal Developer'!D44=TRUE,\"Current Maturity Level\",\"-\")","v":"-"},{"$f":"IF('Internal Developer'!D45=TRUE,\"Current Maturity Level\",\"-\")","v":"Current Maturity Level"}]
["Component 2. Enabling legislation: legislatures and other elected officials","No legislative initiatives undertaken for enabling value capture.","Reliance on one or limited number of value capture tools (e.g., TIFs).","Legislative advocates have been identified and enabling legislation is pending or recently passed.","Full suite of value capture options enabling legislation is available to state and local agencies."]
["Component 2 Placement",{"$f":"IF('Internal Developer'!D83=TRUE, \"-\",IF('Internal Developer'!D87=TRUE,\"Current Maturity Level\",IF('Internal Developer'!D88=TRUE,\"Current Maturity Level\",\"-\")))","v":"-"},{"$f":"IF('Internal Developer'!D83=TRUE, \"\",IF('Internal Developer'!D89=TRUE,\"Current Maturity Level\",\"-\"))","v":"-"},{"$f":"IF('Internal Developer'!D83=TRUE, \"\",IF('Internal Developer'!D90=TRUE,\"Current Maturity Level\",\"-\"))","v":"Current Maturity Level"},{"$f":"IF('Internal Developer'!D83=TRUE,\"Current Maturity Level\",\"-\")","v":"-"}]
["Component 3. Communications: private sector relations—financially interested stakeholders; and public communications—community leaders and interested stakeholders. ","No experience in engaging with private sector stakeholders (developers); public stakeholder engagement limited to those required by policy and planning requirements.","Discussions with interested private sector representatives have begun; public sector stakeholders are aware of and have demonstrated interest in and understanding of value capture concepts.","Committed private sector interests have been identified and potential utilization of value capture options have been fully discussed; public sector stakeholders are comfortable with value capture concepts and are willing to advocate for them and assist in communicating with constituencies.","Ongoing working relationships with both private sector interests and public stakeholders on project involving value capture mechanisms."]
["Component 3 Placement",{"$f":"IF('Internal Developer'!D266=TRUE,\"Current Maturity Level\",IF('Internal Developer'!D271=TRUE,\"Current Maturity Level\",\"-\"))","v":"-"},{"$f":"IF('Internal Developer'!D267=TRUE,\"Current Maturity Level\",IF('Internal Developer'!D268=TRUE,\"Current Maturity Level\",\"-\"))","v":"-"},{"$f":"IF('Internal Developer'!D269=TRUE,\"Current Maturity Level\",\"-\")","v":"-"},{"$f":"IF('Internal Developer'!D270=TRUE,\"Current Maturity Level\",\"-\")","v":"-"}]
["Component 4. \nStaff skills assessment and training: legal, planning, development, contact administration, finance and revenue. ","Staffing and skills required for implementation are only vaguely understood; Little or no emphasis on learning environment other than basic professional certifications (e.g., P.E., AICP, PMP).","Staffing skills required for value capture implementation have been surveyed, deficiencies understood, and training programs in place.","Robust program of targeted learning and professional recognition and rewards for advancement serving value capture implementing needs.","Organizational commitment to training and skill enhancement is funded and rewarded for all required skills consistent with policy and legislative foundations."]
["Component  4 Placement",{"$f":"IF('Internal Developer'!D154=TRUE,\"Current Maturity Level\",IF('Internal Developer'!D158=TRUE,\"Current Maturity Level\",\"-\"))","v":"-"},{"$f":"IF('Internal Developer'!D155=TRUE,\"Current Maturity Level\",\"-\")","v":"-"},{"$f":"IF('Internal Developer'!D157=TRUE,\"Current Maturity Level\",\"-\")","v":"-"},{"$f":"IF('Internal Developer'!D156=TRUE,\"Current Maturity Level\",\"-\")","v":"-"}]
["Component 5. \nStaff management: turnover and institutional memory","Value capture options not clearly understood or embraced by management or staff; responsibility for value capture program implementation is not clear within organization.","Staff managers are committed to understanding and implementing value capture methods; Responsibility highly dispersed or compartmentalized and housed in legacy organizational silos.","Organizational and management structure is in place to foster use and implementation of value capture as part of project planning and delivery.","Responsibility for administering ongoing funding and financing for value capture techniques is clearly designated and known throughout organization."]
["Component 5 Placement",{"$f":"IF('Internal Developer'!D74=TRUE,\"-\",IF('Internal Developer'!D49=TRUE,\"Current Maturity Level\",IF('Internal Developer'!D50=TRUE,\"Current Maturity Level\",\"-\")))","v":"-"},{"$f":"IF('Internal Developer'!D74=TRUE,\"-\",IF('Internal Developer'!D51=TRUE,\"Current Maturity Level\",IF('Internal Developer'!D52=TRUE,\"Current Maturity Level\",\"-\")))","v":"-"},{"$f":"IF('Internal Developer'!D74=TRUE,\"-\",IF('Internal Developer'!D53=TRUE,\"Current Maturity Level\",\"-\"))","v":"-"},{"$f":"IF('Internal Developer'!D74=TRUE,\"Current Maturity Level\",\"-\")","v":"-"}]
["Component 6. Interagency coordination: across departments, municipalities, counties, or regions","Limited to coordinating project prioritization under STIP or similar programs.","Working relationships have been developed with MPOs and LPAs in areas other than value capture and cooperative finance; discussions about coordination of value capture issues have not been undertaken.","Discussion and interest around value capture use and implementation has been undertaken with initial interest and use as funding for potential projects (e.g., STIP) as part of the planning process.","Ongoing coordination on projects implemented using value capture methods at multiple levels of regional and local government."]
["Component 6 Placement",{"$f":"IF('Internal Developer'!D195=TRUE,\"Current Maturity Level\",IF('Internal Developer'!D196=TRUE,\"Current Maturity Level\",\"-\"))","v":"-"},{"$f":"IF('Internal Developer'!D197=TRUE,\"Current Maturity Level\",\"-\")","v":"-"},{"$f":"IF('Internal Developer'!D198=TRUE,\"Current Maturity Level\",\"-\")","v":"-"},{"$f":"IF('Internal Developer'!D199=TRUE,\"Current Maturity Level\",\"-\")","v":"-"}]
{"$rows_left_out":4}
{"sheet":"SAVED","index":7,"n_rows":18,"n_cols":5,"rows_kept":18,"cut":false,"hidden":false,"merged":[]}
["Public Agency Self-Assessment Tool for Value Capture Implementation"]
["Saved CMM Self-Assessment Results"]
["Component ","Level 1. Informal understanding","Level 2. Implementation Planning","Level 3. Active Adoption","Level 4. Institutional Maturity"]
["Component 1. Policy: appointed leadership and senior staff "]
["Component 1 Placement"]
["Component 2. Enabling legislation: legislatures and other elected officials"]
["Component 2 Placement"]
["Component 3. Communications: private sector relations—financially interested stakeholders; and public communications—community leaders and interested stakeholders. "]
["Component 3 Placement"]
["Component 4. \nStaff skills assessment and training: legal, planning, development, contact administration, finance and revenue. "]
["Component  4 Placement"]
["Component 5. \nStaff management: turnover and institutional memory"]
["Component 5 Placement"]
["Component 6. Interagency coordination: across departments, municipalities, counties, or regions"]
["Component 6 Placement"]
{"$rows_left_out":4}
{"sheet":"Table 1","index":8,"n_rows":20,"n_cols":4,"rows_kept":20,"cut":false,"hidden":false,"merged":[[3,0,4,0],[6,0,9,0],[10,0,11,0],[12,0,14,0]]}
["Public Agency Self-Assessment Tool for Value Capture Implementation"]
["Overview of Value-Capture Categories, Techniques, and Definitions"]
["Category","Technique","Category & Technique","Definition"]
["Developer contributions","Impact fees","Developer contributions: Impact fees","Fees imposed on developers to help fund additional public services, infrastructure, or transportation facilities required due to the new development."]
[null,"Negotiated exactions","Developer contributions: Negotiated exactions","Negotiated charges imposed on developers to mitigate the cost of public services or infrastructure required as a result of the new development."]
["Transportation utility fees","Transportation utility fees","Transportation utility fees: Transportation utility fees","Fees paid by property owners or building occupants to a municipality based on estimated use of the transportation system."]
["Special taxes and fees","Special assessment districts","Special taxes and fees: Special assessment districts","Fees charged on property owners in a designated district whose properties are the primary beneficiaries of an infrastructure improvement."]
[null,"Business improvement districts","Special taxes and fees: Business improvement districts","Fees or levies charged on businesses in a designated district to fund or finance projects or services in the district's boundaries."]
[null,"Land value taxes or split-rate taxes","Special taxes and fees: Land value taxes or split-rate taxes","A lower property tax rate applied to privately created building values and a higher rate applied to publicly created land values."]
[null,"Sales tax districts","Special taxes and fees: Sales tax districts","Additional sales taxes levied on all transactions or purchases in a designated area that benefits from an infrastructure improvement."]
["Tax increment financing","Tax increment financing","Tax increment financing: Tax increment financing","Charges that capture incremental property tax value increases from an investment in a designated district to fund or finance the investment."]
[null,"Transportation reinvestment zones","Tax increment financing: Transportation reinvestment zones","Transportation reinvestment zones allow for a broader range of transportation projects. The local governing body designates a zone in which it will promote a transportation project. The zone does not require the local entity to create a board."]
["Joint development","At-grade joint development","Joint development: At-grade joint development","Projects that occur within the existing development rights of a transportation project."]
[null,"Above-grade joint development","Joint development: Above-grade joint development","Projects that involve the transfer of air rights, which are development rights above or below transportation infrastructure."]
[null,"Utility joint development","Joint development: Utility joint development","Projects that take advantage of the synergies of broadband and other utilities with highway right-of-way."]
{"$rows_left_out":6}
{"sheet":"Internal Developer","index":9,"n_rows":271,"n_cols":16,"rows_kept":271,"cut":false,"hidden":true,"merged":[]}
["Self assessemnt Results - Background connections"]
[]
["questions","Index",null,"Values (a)","Values (b)","Modified Drop Down Box","Connection to CMM",null,"Tab","Developer notes","Error Check","Error Message (1)","Error Message (2)","Additional Drop down menus"]
[1,null,null,null,null,null,null,null,"Funding & Financing Need",null,null,null,null,"x"]
[null,null,null,"Sufficient Funds Available"]
[null,null,"Capital costs and construction",{"$f":"'1. Funding & Financing Need'!C4","v":0},null,null,null,null,null,null,null,null,null,"Sufficient Funds Available","Funding is Moderately Limited","Funding is Highly Competitive"]
[null,null,"Operations and maintenance",{"$f":"'1. Funding & Financing Need'!C5","v":0}]
[]
[2,null,null,null,null,null,null,null,"Funding & Financing Need"]
[null,null,null,"Checkmark","$"]
[null,null,"Capital Costs and construction",false,{"$f":"'1. Funding & Financing Need'!#REF!","v":{"$error":"#REF!"}}]
[null,null,"Operation and Maintenance Costs",false,{"$f":"'1. Funding & Financing Need'!#REF!","v":{"$error":"#REF!"}}]
[]
[3,null,null,null,null,null,null,null,"Funding & Financing Need"]
[null,null,null,"Checkmark",null,{"$f":"'1. Funding & Financing Need'!C11","v":0}]
{"$rows_left_out":257}
{"sheet":"Internal READme","index":10,"n_rows":7,"n_cols":2,"rows_kept":7,"cut":false,"hidden":true,"merged":[]}
[]
[]
[null,"NOTES: "]
[1,"Column AA in each question sheet has all list references hidden (white background, white text). For drop down boxes and citations for CMM directly linked questions"]
[null,"All links in \"Internal Developer\""]
[2,"Tab Names shouldn't be changed or will break macros"]
[3,"Unlock via macros. Set password."]